{"text_format":"1","workbook":"xlsx","n_sheets":8,"sheets":["Introduction","Carbon Tax model","Energy Consumption model","Model settings","CTax variables","Energy variables","Schedule 1","Schedule 2"],"not_rendered":{"charts":3,"images":8,"macros":1,"external_links":0,"defined_names":4,"comments":1,"pivot_tables":0},"unopened":[],"bounds":{"document_bytes":16777216,"sheet_cells":100000,"rows_first":2000,"rows_last":500,"rows_between":2000,"halvings":0,"cell_chars":16384,"cell_head_chars":4096},"cells_cut":0,"cells_raw":0,"read":"whole","date_system":"1900"}

{"sheet":"Introduction","index":0,"n_rows":32,"n_cols":18,"rows_kept":32,"cut":false,"hidden":false,"merged":[[5,10,10,19],[31,10,37,19],[13,10,24,12],[28,10,28,11],[26,3,27,3],[26,4,27,4],[28,14,28,15],[28,17,28,18],[5,4,6,4]]}
[]
[null,"Clay Brick Carbon Tax and Energy model introduction"]
[]
[null,null,"Carbon and Energy legislation and regulation in South Africa",null,null,null,null,null,"The Carbon Tax and Energy Impact assessment model"]
[null,null,null,"South Africa Carbon Tax Infogram",null,null,null,null,null,"Description"]
[null,null,null,null,"A Carbon tax of 120 ZAR/tCO2e for stationary fossil fuel based GHG emissions for carbon intensive sectors including the Clay Brick Sector is expected to be introduced in 2017.",null,null,null,null,null,"The Carbon Tax Impact Assessment Model allows individual brick makers to determine the total volume of emissions over which it will become liable under the Carbon Tax as well as the total costs and the costs per 1000 standards bricks it will incur. In addition to this the model will provide insight into the energy consumption and both energy and carbon mitigation options."]
[]
[]
[]
[]
[]
[]
[null,null,null,null,null,null,null,null,null,"The Carbon Tax Waterfall"]
[null,null,null,null,null,null,null,null,null,null,"The Carbon Tax Waterfall aims at providing a schematic breakdown of the emissions over which an entity becomes liable under the Carbon tax. The waterfall provides insight into the main contributors to the taxable emissions as well as components that can reduce and entity’s exposure."]
[]
[]
[]
[]
[]
[]
[]
[]
[]
[null,null,null,"Clay brick sector energy profile"]
[null,null,null,null,"A breakdown of the body energy, firing energy, electrical energy and transport energy used for the production of Clay bricks in South Africa."]
[]
[null,null,null,null,null,null,null,null,null,"Operation fo the Model"]
[]
[null,null,null,null,null,null,null,null,null,null,"Input variables",null,null,null,"Setting",null,null,"Results"]
[]
{"$rows_left_out":3}
{"sheet":"Carbon Tax model","index":1,"n_rows":40,"n_cols":17,"rows_kept":40,"cut":false,"hidden":false,"merged":[[26,9,27,11],[26,12,27,12],[26,13,27,13],[26,14,27,14],[26,15,27,15]]}
[]
[null,"Clay Brick Carbon Tax Impact Assessment Model"]
[]
[null,"Profile",null,null,null,null,null,null,null,null,null,null,null,null,null,null,"Carbon Tax Exposure (tCO2e)"]
[null,null,"Entity",null,null,null,null,"tCO2e"]
[null,null,null,"In which province of South Africa are you located?",null,null,"Please select"]
[null,null,null,"What kind of firing technology do you use?",null,null,"Please select"]
[null,null,"Carbon Tax"]
[null,null,null,"Do you export a share of your saleable bricks?",null,null,"Please select",{"$f":"IF(G9=\"Yes\",1,0)","v":0},null,null,null,"Component","lift","tCO2e","ZAR","tCO2e/kStB"]
[null,null,null,"Are you partaking in the Carbon budgeting process?",null,null,"Please select",null,null,null,null,"Gross direct emissions",0,{"$f":"H18+H19+H20+H22+H23+H24+H26+H27+H28","v":5060.9535999999998},{"$f":"N10*'Model settings'!$D$10","v":607314.43200000003},{"$f":"N10/$F$16","v":0.33739690666666666},{"$f":"O10/$F$16","v":40.487628800000003}]
[null,null,null,"Do you use organic fuel that is renewable?",null,null,"Please select",{"$f":"IF(G11=\"Yes\",1,0)","v":0},null,null,null,"Transport emissions",{"$f":"N10-N11","v":5060.8535999999995},{"$f":"H26+H27+H28","v":0.1},{"$f":"N11*'Model settings'!$D$10","v":12},{"$f":"N11/$F$16","v":6.6666666666666666E-6},{"$f":"O11/$F$16","v":8.0000000000000004E-4}]
[null,null,null,null,null,null,null,null,null,null,null,"Sequestration of emissions",{"$f":"M11-N12","v":5060.7535999999991},{"$f":"H36+H37+H38","v":0.1},{"$f":"N12*'Model settings'!$D$10","v":12},6.6666666666666666E-6,8.0000000000000004E-4]
[null,"Activity level",null,null,null,null,null,null,null,null,null,"Gross taxable emissions",0,{"$f":"N10-N11-N12","v":5060.7535999999991},{"$f":"N13*'Model settings'!$D$10","v":607290.43199999991},{"$f":"N13/$F$16","v":0.3373835733333333},40.486028799999993]
[null,null,"Production",null,null,"Volume","UoM",null,null,null,null,"Basic tax-free allowance",{"$f":"N13-N14","v":2024.3014399999997},{"$f":"('Model settings'!F5/100)*$N$13","v":3036.4521599999994},{"$f":"N14*'Model settings'!$D$10","v":364374.25919999991},0.20243014399999995,24.291617279999993]
[null,null,null,"Green Bricks",null,20000,"1000 Standard Bricks",null,null,null,null,"Trade exposure allowance",{"$f":"M14-N15","v":2024.2914399999997},{"$f":"IF(G9=\"Yes\",('Model settings'!I5/100)*(F34/F16)*N13,0.01)","v":0.01},{"$f":"N15*'Model settings'!$D$10","v":1.2},6.6666666666666671E-7,7.9999999999999993E-5]
[null,null,null,"Saleable Bricks",null,15000,"1000 Standard Bricks",null,null,null,null,"Z-factor allowance",{"$f":"M15-N16","v":1771.2537599999998},{"$f":"('Model settings'!J5/100)*N13","v":253.03767999999997},{"$f":"N16*'Model settings'!$D$10","v":30364.521599999996},1.6869178666666665E-2,2.0243014399999999]
[null,null,"Body Fuel",null,"Type","Volume","UoM",null,null,null,null,"Carbon budget allowance",1771.1537599999999,{"$f":"IF(G10=\"Yes\",('Model settings'!K5/100)*N13,0.1)","v":0.1},{"$f":"N17*'Model settings'!$D$10","v":12},6.6666666666666666E-6,8.0000000000000004E-4]
[null,null,null,"Fuel 1","CHARCOAL",1500,"Metric ton",{"$f":"VLOOKUP(E18,'CTax variables'!$D$4:$F$24,2,FALSE)*F18","v":5038.95},null,null,null,"Offsets allowance",1771.05376,{"$f":"H40","v":0.1},{"$f":"N18*'Model settings'!$D$10","v":12},6.6666666666666666E-6,8.0000000000000004E-4]
[null,null,null,"Fuel 2","FINE COAL",12,"Metric ton",{"$f":"VLOOKUP(E19,'CTax variables'!$D$4:$F$24,2,FALSE)*F19","v":21.903599999999997},null,null,null,"Net taxable emissions",{"$f":"M18-N19","v":0},{"$f":"N13-N14-N15-N16-N17-N18","v":1771.05376},{"$f":"N19*'Model settings'!$D$10","v":212526.45120000001},0.11807025066666667,14.16843008]
[null,null,null,"Fuel 3","Please select",0,"Metric ton",{"$f":"VLOOKUP(E20,'CTax variables'!$D$4:$F$24,2,FALSE)*F20","v":0}]
[null,null,"Firing Fuel",null,"Type","Volume","UoM"]
[null,null,null,"Fuel 1","Please select",0,"Metric ton",{"$f":"VLOOKUP(E22,'CTax variables'!$D$27:$F$58,2,FALSE)*F22","v":0}]
[null,null,null,"Fuel 2","Please select",0,"Metric ton",{"$f":"VLOOKUP(E23,'CTax variables'!$D$27:$F$58,2,FALSE)*F23","v":0}]
[null,null,null,"Fuel 3","Please select",0,"Metric ton",{"$f":"VLOOKUP(E24,'CTax variables'!$D$27:$F$58,2,FALSE)*F24","v":0}]
[null,null,"Transport Fuel",null,"Type","Volume","UoM"]
[null,null,null,"Fuel 1","Please select",0,"Metric ton",{"$f":"IF(F26=0,0.1,VLOOKUP(E26,'CTax variables'!$D$62:$F$69,2,FALSE)*F26)","v":0.1},null,"Carbon Tax"]
[null,null,null,"Fuel 2","Please select",0,"Metric ton",{"$f":"VLOOKUP(E27,'CTax variables'!$D$62:$F$69,2,FALSE)*F27","v":0},null,"Carbon Tax exposure",null,null,"Gross direct emissions","Gross taxable emissions","Net taxable emissions","Per 1000 standard bricks"]
[null,null,null,"Fuel 3","Please select",0,"Metric ton",{"$f":"VLOOKUP(E28,'CTax variables'!$D$62:$F$69,2,FALSE)*F28","v":0}]
[null,null,"Electricity",null,"Type","Volume","UoM",null,null,null,"Volume (tCO2e)",null,{"$f":"N10","v":5060.9535999999998},{"$f":"N13","v":5060.7535999999991},{"$f":"N19","v":1771.05376},{"$f":"P19","v":0.11807025066666667}]
[null,null,null,"Consumption","Electricity",0,"MWh",{"$f":"F30*'Model settings'!D8","v":0},null,null,"Costs (ZAR)",null,{"$f":"O10","v":607314.43200000003},{"$f":"O13","v":607290.43199999991},{"$f":"O19","v":212526.45120000001},{"$f":"Q19","v":14.16843008}]
{"$rows_left_out":11}
{"sheet":"Energy Consumption model","index":2,"n_rows":40,"n_cols":14,"rows_kept":40,"cut":false,"hidden":false,"merged":[]}
[]
[null,"Clay Brick Energy Consumption Model"]
[]
[null,"Activity level",null,null,null,null,null,null,null,"Green Bricks",null,null,null,"Energy profile (GJ/1000 Standard Bricks)"]
[null,null,"Production",null,null,"Volume","UoM"]
[null,null,null,"Green Bricks",null,{"$f":"'Carbon Tax model'!F15","v":20000},"1000 Standard Bricks"]
[null,null,null,"Saleable Bricks",null,{"$f":"'Carbon Tax model'!F16","v":15000},"1000 Standard Bricks"]
[]
[null,null,"Body Fuel",null,"Type","Volume (Metric ton)","Energy (GJ/Metric ton) or CV (MJ/kg)"]
[null,null,null,"Fuel 1","Please select",100,3,{"$f":"F10*G10","v":300}]
[null,null,null,"Fuel 2","Please select",0,0,{"$f":"F11*G11","v":0}]
[null,null,null,"Fuel 3","Please select",0,0,0]
[null,null,null,null,null,null,null,{"$f":"SUM(H10:H12)","v":300},"t"]
[null,null,"Firing Fuel",null,"Type","Volume (Metric ton)","Energy (GJ/Metric ton) or CV (MJ/kg)"]
[null,null,null,"Fuel 1","Please select",200,4,{"$f":"F15*G15","v":800},null,null,null,"Green bricks","GJ/1k Standard Bricks"]
[null,null,null,"Fuel 2","Please select",0,0,{"$f":"F16*G16","v":0},null,null,null,"Body energy",{"$f":"H13/$F$6","v":1.4999999999999999E-2}]
[null,null,null,"Fuel 3","Please select",0,0,0,null,null,null,"Firing energy",{"$f":"H18/$F$6","v":0.04}]
[null,null,null,null,null,null,null,{"$f":"SUM(H15:H17)","v":800},"t",null,null,"Transport energy",{"$f":"H23/$F$6","v":2.0250000000000001E-2}]
[null,null,"Transport Fuel",null,"Type","Volume (Metric ton)","Energy (GJ/Metric ton) or CV (MJ/kg)",null,null,null,null,"Electricity",{"$f":"H25/$F$6","v":2.16E-3}]
[null,null,null,"Fuel 1","Please select",45,9,{"$f":"F20*G20","v":405},null,null,null,"Total",{"$f":"H26/$F$6","v":7.7410000000000007E-2}]
[null,null,null,"Fuel 2","Please select",0,0,{"$f":"F21*G21","v":0}]
[null,null,null,"Fuel 3","Please select",0,0,0]
[null,null,null,null,null,null,null,{"$f":"SUM(H20:H22)","v":405},"t"]
[null,null,"Electricity",null,"Type","Volume (MWh)","Energy (GJ/MWh)"]
[null,null,null,"Consumption","Electricity",12,3.6,{"$f":"F25*G25","v":43.2},"t"]
[null,null,null,null,null,null,null,{"$f":"H13+H18+H23+H25","v":1548.2},"tt"]
[null,"Energy profile (GJ/1000 Standard Bricks)",null,null,null,null,null,null,null,"Saleable Bricks",null,null,null,"Energy profile (GJ/1000 Standard Bricks)"]
[null,null,null,"Green Brick energy components","Total","Per 1000 Standard bricks","Relative difference to sector benchmark (%)"]
[null,null,null,"Body energy",{"$f":"H13","v":300},{"$f":"M16","v":1.4999999999999999E-2},{"$f":"(F29/$F$33)*$G$33","v":5.5555555555555549E-3},null,null,null,null,"Saleable Bricks","GJ/1k Standard Bricks"]
[null,null,null,"Firing energy",{"$f":"H18","v":800},{"$f":"M17","v":0.04},{"$f":"(F30/$F$33)*$G$33","v":1.4814814814814815E-2},null,null,null,null,"Body energy",{"$f":"H13/$F$7","v":0.02}]
{"$rows_left_out":11}
{"sheet":"Model settings","index":3,"n_rows":56,"n_cols":13,"rows_kept":56,"cut":false,"hidden":true,"merged":[]}
[]
[]
[null,"Schedule 2"]
[null,null,null,null,"Sector","Basic tax-free allowance for fossil fuel combustion emissions %","Basic tax-free allowance for process emissions %","Fugitive emissions allowance %","Trade exposure allowance %","Z-factor allowance %","Carbon budget allowance %","Offsets allowance %","Maximum total allowances %"]
[null,null,"Fuel combustion","Energy Industries","Construction",60,0,0,10,5,5,10,90]
[]
[null,"Electricity emission factor",null,null,null,"GJ/Mwh"]
[null,null,null,1.01,"tCO2e/MWh",3.6,"GJ/Mwh"]
[null,"Tax rate"]
[null,null,"Rate",120,"ZAR/TCO2e"]
[]
[null,"Clay brick energy intensity",null,null,null,"GJ/1000 Standard Bricks",null,"Source: LCA"]
[null,null,null,null,null,2.7]
[]
[null,"Clay brick Carbon intensity",null,null,null,"TCO2e/1000 Standard Bricks",null,"Source: ?????"]
[]
[]
[]
[null,"Tax components"]
[null,null,"Gross direct emissions"]
[null,null,"Transport emissions"]
[null,null,"Sequestration of emissions"]
[null,null,"Gross taxable emissions"]
[null,null,"Basic tax-free allowance for fossil fuel combustion emissions"]
[null,null,"Trade exposure allowance"]
[null,null,"Z-factor allowance"]
[null,null,"Carbon budget allowance"]
[null,null,"Offsets allowance"]
[null,null,"Maximum total allowances"]
[null,null,"Net taxable emissions"]
{"$rows_left_out":27}
{"sheet":"CTax variables","index":4,"n_rows":75,"n_cols":6,"rows_kept":75,"cut":false,"hidden":true,"merged":[]}
[]
[null,"STATIONARY SOURCE"]
[null,null,"TYPE","FUEL TYPE","GHG EMISSION FACTOR (CO2e) PER TONNE","UoM"]
[null,null,"Body Fuel","Please select",0,"Metric ton"]
[null,null,"Body Fuel","ANTHRACITE",2.6371000000000002,"Metric ton"]
[null,null,"Body Fuel","BITUMEN",3.2541000000000002,"Metric ton"]
[null,null,"Body Fuel","BROWN COAL BRIQUETTES",2.0278999999999998,"Metric ton"]
[null,null,"Body Fuel","CHARCOAL",3.3593000000000002,"Metric ton"]
[null,null,"Body Fuel","COAL TAR",2.2726999999999999,"Metric ton"]
[null,null,"Body Fuel","COAL SLURRY",{"$f":"E18","v":1.8252999999999999},"Metric ton"]
[null,null,"Body Fuel","COKE OVEN COKE AND LIGNITE COKE",3.0306000000000002,"Metric ton"]
["x",null,"Body Fuel","FILTER CAKE",{"$f":"E6","v":3.2541000000000002},"Metric ton"]
["x",null,"Body Fuel","FINE COAL",{"$f":"E18","v":1.8252999999999999},"Metric ton"]
[null,null,"Body Fuel","FLY ASH",{"$f":"E5*0.42","v":1.1075820000000001},"Metric ton"]
[null,null,"Body Fuel","LIGNITE",1.2075,"Metric ton"]
[null,null,"Body Fuel","MUNICIPAL WASTES (BIOMASS FRACTION)",1.1817,"Metric ton"]
[null,null,"Body Fuel","MUNICIPAL WASTES (NON BIOMASS FRACTION)",0.93569999999999998,"Metric ton"]
[null,null,"Body Fuel","OTHER BITUMINOUS COAL",1.8252999999999999,"Metric ton"]
[null,null,"Body Fuel","OTHER PRIMARY SOLID BIOMASS",1.1817,"Metric ton"]
[null,null,"Body Fuel","PEAT",1.0390999999999999,"Metric ton"]
[null,null,"Body Fuel","PETROLEUM COKE",3.1768000000000001,"Metric ton"]
["x",null,"Body Fuel","SPIRAL DUFF",{"$f":"E9","v":2.2726999999999999},"Metric ton"]
[null,null,"Body Fuel","SUB-BITUMINOUS COAL",1.8541000000000001,"Metric ton"]
[null,null,"Body Fuel","WOOD/WOOD WASTE",1.7764,"Metric ton"]
[]
[null,null,"TYPE","FUEL TYPE","GHG EMISSION FACTOR (CO2e) PER TONNE","UoM"]
[null,null,"Firing Fuel","Please select",0,"Metric ton"]
[null,null,"Firing Fuel","ANTHRACITE",2.6371000000000002,"Metric ton"]
[null,null,"Firing Fuel","BITUMEN",3.2541000000000002,"Metric ton"]
[null,null,"Firing Fuel","BIODIESEL",1.9182999999999999,"Metric ton"]
{"$rows_left_out":46}
{"sheet":"Energy variables","index":5,"n_rows":67,"n_cols":6,"rows_kept":67,"cut":false,"hidden":true,"merged":[]}
[]
[null,"STATIONARY SOURCE"]
[null,null,"TYPE","FUEL TYPE","ENERGY CONTENT","UoM"]
[null,null,"Body Fuel","Please select",0,"GJ/Metric ton"]
[null,null,"Body Fuel","ANTHRACITE",{"$f":"(29.3+33.5)/2","v":31.4},"GJ/Metric ton"]
[null,null,"Body Fuel","BITUMEN",{"$f":"(29.3+33.5)/2","v":31.4},"GJ/Metric ton"]
[null,null,"Body Fuel","BROWN COAL BRIQUETTES",{"$f":"(29.3+33.5)/2","v":31.4},"GJ/Metric ton"]
[null,null,"Body Fuel","CHARCOAL",30,"GJ/Metric ton"]
[null,null,"Body Fuel","COAL TAR",{"$f":"(29.3+33.5)/2","v":31.4},"GJ/Metric ton"]
[null,null,"Body Fuel","COAL SLURRY",{"$f":"E21/2","v":15.7},"GJ/Metric ton"]
[null,null,"Body Fuel","COKE OVEN COKE AND LIGNITE COKE",{"$f":"(29.3+33.5)/2","v":31.4},"GJ/Metric ton"]
[null,null,"Body Fuel","FILTER CAKE",{"$f":"E6","v":31.4},"GJ/Metric ton"]
[null,null,"Body Fuel","FINE COAL",{"$f":"E18","v":31.4},"GJ/Metric ton"]
[null,null,"Body Fuel","FLY ASH",{"$f":"E5/2","v":15.7},"GJ/Metric ton"]
[null,null,"Body Fuel","LIGNITE",{"$f":"(29.3+33.5)/2","v":31.4},"GJ/Metric ton"]
[null,null,"Body Fuel","MUNICIPAL WASTES (BIOMASS FRACTION)",18.5,"GJ/Metric ton"]
[null,null,"Body Fuel","MUNICIPAL WASTES (NON BIOMASS FRACTION)",32.564,"GJ/Metric ton"]
[null,null,"Body Fuel","OTHER BITUMINOUS COAL",{"$f":"(29.3+33.5)/2","v":31.4},"GJ/Metric ton"]
[null,null,"Body Fuel","OTHER PRIMARY SOLID BIOMASS",18.5,"GJ/Metric ton"]
[null,null,"Body Fuel","PEAT",13,"GJ/Metric ton"]
[null,null,"Body Fuel","PETROLEUM COKE",{"$f":"(29.3+33.5)/2","v":31.4},"GJ/Metric ton"]
[null,null,"Body Fuel","SPIRAL DUFF",{"$f":"E9","v":31.4},"GJ/Metric ton"]
[null,null,"Body Fuel","SUB-BITUMINOUS COAL",{"$f":"(29.3+33.5)/2","v":31.4},"GJ/Metric ton"]
[null,null,"Body Fuel","WOOD/WOOD WASTE",{"$f":"(16+21)/2","v":18.5},"GJ/Metric ton"]
[]
[null,null,"TYPE","FUEL TYPE","ENERGY CONTENT","UoM"]
[null,null,"Firing Fuel","Please select",0,"GJ/Metric ton"]
[null,null,"Firing Fuel","ANTHRACITE",{"$f":"(29.3+33.5)/2","v":31.4},"GJ/Metric ton"]
[null,null,"Firing Fuel","BITUMEN",{"$f":"(29.3+33.5)/2","v":31.4},"GJ/Metric ton"]
[null,null,"Firing Fuel","BIODIESEL",37.799999999999997,"GJ/Metric ton"]
{"$rows_left_out":38}
{"sheet":"Schedule 1","index":6,"n_rows":271,"n_cols":9,"rows_kept":271,"cut":false,"hidden":true,"merged":[]}
[]
[null,"SCHEDULE 1 Carbon Tax draft Bill"]
[]
[]
[null,null,"TABLE","TYPE","CATEGORY",null,"FUEL TYPE","GHG EMISSION FACTOR","UoM"]
[null,6,"Table 1","Energy Combustion Emission Factors","STATIONARY SOURCE CATEGORY",null,"ANTHRACITE",2.6371000000000002,"(CO2e) PER TONNE"]
[null,7,"Table 1","Energy Combustion Emission Factors","STATIONARY SOURCE CATEGORY",null,"AVIATION GASOLINE",2.4095,"(CO2e) PER TONNE"]
[null,8,"Table 1","Energy Combustion Emission Factors","STATIONARY SOURCE CATEGORY",null,"BIODIESEL",1.9182999999999999,"(CO2e) PER TONNE"]
[null,9,"Table 1","Energy Combustion Emission Factors","STATIONARY SOURCE CATEGORY",null,"BIOGASOLINE",1.9182999999999999,"(CO2e) PER TONNE"]
[null,10,"Table 1","Energy Combustion Emission Factors","STATIONARY SOURCE CATEGORY",null,"BITUMEN",3.2541000000000002,"(CO2e) PER TONNE"]
[null,11,"Table 1","Energy Combustion Emission Factors","STATIONARY SOURCE CATEGORY",null,"BLAST FURNACE GAS",0.64229999999999998,"(CO2e) PER TONNE"]
[null,12,"Table 1","Energy Combustion Emission Factors","STATIONARY SOURCE CATEGORY",null,"BROWN COAL BRIQUETTES",2.0278999999999998,"(CO2e) PER TONNE"]
[null,13,"Table 1","Energy Combustion Emission Factors","STATIONARY SOURCE CATEGORY",null,"CHARCOAL",3.3593000000000002,"(CO2e) PER TONNE"]
[null,14,"Table 1","Energy Combustion Emission Factors","STATIONARY SOURCE CATEGORY",null,"COAL TAR",2.2726999999999999,"(CO2e) PER TONNE"]
[null,15,"Table 1","Energy Combustion Emission Factors","STATIONARY SOURCE CATEGORY",null,"COKE OVEN COKE AND LIGNITE COKE",3.0306000000000002,"(CO2e) PER TONNE"]
[null,16,"Table 1","Energy Combustion Emission Factors","STATIONARY SOURCE CATEGORY",null,"COKE OVEN GAS",1.7202999999999999,"(CO2e) PER TONNE"]
[null,17,"Table 1","Energy Combustion Emission Factors","STATIONARY SOURCE CATEGORY",null,"COKING COAL",2.0914999999999999,"(CO2e) PER TONNE"]
[null,18,"Table 1","Energy Combustion Emission Factors","STATIONARY SOURCE CATEGORY",null,"CRUDE OIL",3.2214,"(CO2e) PER TONNE"]
[null,19,"Table 1","Energy Combustion Emission Factors","STATIONARY SOURCE CATEGORY",null,"DIESEL",2.8325999999999998,"(CO2e) PER TONNE"]
[null,20,"Table 1","Energy Combustion Emission Factors","STATIONARY SOURCE CATEGORY",null,"ETHANE",2.8607,"(CO2e) PER TONNE"]
[null,21,"Table 1","Energy Combustion Emission Factors","STATIONARY SOURCE CATEGORY",null,"GAS COKE",1.8520000000000001,"(CO2e) PER TONNE"]
[null,22,"Table 1","Energy Combustion Emission Factors","STATIONARY SOURCE CATEGORY",null,"GAS WORKS GAS",1.7202999999999999,"(CO2e) PER TONNE"]
[null,23,"Table 1","Energy Combustion Emission Factors","STATIONARY SOURCE CATEGORY",null,"INDUSTRIAL WASTES",null,"(CO2e) PER TONNE"]
[null,24,"Table 1","Energy Combustion Emission Factors","STATIONARY SOURCE CATEGORY",null,"JET GASOLINE",2.4095,"(CO2e) PER TONNE"]
[null,25,"Table 1","Energy Combustion Emission Factors","STATIONARY SOURCE CATEGORY",null,"JET KEROSENE",2.4609000000000001,"(CO2e) PER TONNE"]
[null,26,"Table 1","Energy Combustion Emission Factors","STATIONARY SOURCE CATEGORY",null,"LANDFILL GAS",2.7545000000000002,"(CO2e) PER TONNE"]
[null,27,"Table 1","Energy Combustion Emission Factors","STATIONARY SOURCE CATEGORY",null,"LIGNITE",1.2075,"(CO2e) PER TONNE"]
[null,28,"Table 1","Energy Combustion Emission Factors","STATIONARY SOURCE CATEGORY",null,"LIQUEFIED PETROLEUM GASES",1.6861999999999999,"(CO2e) PER TONNE"]
[null,29,"Table 1","Energy Combustion Emission Factors","STATIONARY SOURCE CATEGORY",null,"LUBRICANTS",2.9565999999999999,"(CO2e) PER TONNE"]
[null,30,"Table 1","Energy Combustion Emission Factors","STATIONARY SOURCE CATEGORY",null,"MUNICIPAL WASTES (BIOMASS FRACTION)",1.1817,"(CO2e) PER TONNE"]
{"$rows_left_out":242}
{"sheet":"Schedule 2","index":7,"n_rows":97,"n_cols":12,"rows_kept":97,"cut":false,"hidden":true,"merged":[]}
[]
[null,"SCHEDULE 2 Carbon Tax draft Bill"]
[]
[]
[]
[]
[]
[null,null,null,"Sector","Basic tax-free allowance for fossil fuel combustion emissions %","Basic tax-free allowance for process emissions %","Fugitive emissions allowance %","Trade exposure allowance %","Z-factor allowance %","Carbon budget allowance %","Offsets allowance %","Maximum total allowances %"]
[null,"Fuel combustion","Energy Industries","Main activity electricity and heat production",60,0,0,0,0,5,10,75]
[null,"Fuel combustion","Energy Industries","Petroleum refining",60,0,0,10,5,5,10,90]
[null,"Fuel combustion","Energy Industries","Manufacture of solid fuels & other energy industries",60,0,0,10,5,5,10,90]
[null,"Fuel combustion","Energy Industries","Manufacturing industries and Construction",60,0,0,10,5,5,10,90]
[null,"Fuel combustion","Energy Industries","Iron and steel",60,0,0,10,5,5,10,90]
[null,"Fuel combustion","Energy Industries","Non-ferrous metals energy",60,0,0,10,5,5,10,90]
[null,"Fuel combustion","Energy Industries","Chemicals",60,0,0,10,5,5,10,90]
[null,"Fuel combustion","Energy Industries","Pulp, paper and print",60,0,0,10,5,5,10,90]
[null,"Fuel combustion","Energy Industries","Food processing; beverage; tobacco",60,0,0,10,5,5,10,90]
[null,"Fuel combustion","Energy Industries","Non-metallic minerals",60,0,0,10,5,5,10,90]
[null,"Fuel combustion","Energy Industries","Transport Equipment",60,0,0,10,5,5,10,90]
[null,"Fuel combustion","Energy Industries","Machinery",60,0,0,10,5,5,10,90]
[null,"Fuel combustion","Energy Industries","Mining (excluding fuels) and quarrying",60,0,0,10,5,5,10,90]
[null,"Fuel combustion","Energy Industries","Wood and wood products",60,0,0,10,5,5,10,90]
[null,"Fuel combustion","Energy Industries","Construction",60,0,0,10,5,5,10,90]
[null,"Fuel combustion","Energy Industries","Textiles and leather",60,0,0,10,5,5,10,90]
[null,"Fuel combustion","Energy Industries","Non-specified industry",60,0,0,10,5,5,10,90]
[null,"Fuel combustion","Transport","Civil aviation",60,0,0,10,5,5,10,90]
[null,"Fuel combustion","Transport","Road transport",60,0,0,10,5,5,10,90]
[null,"Fuel combustion","Transport","Railways",60,0,0,10,5,5,10,90]
[null,"Fuel combustion","Transport","Water-borne navigation",60,0,0,10,5,5,10,90]
[null,"Fuel combustion","Transport","Other transport",60,0,0,10,5,5,10,90]
{"$rows_left_out":67}